Google
  Web www.spinics.net

[Openh323-devel] Compile issues

[Date Prev][Date Next][Thread Prev][Thread Next][Date Index][Thread Index]


Trying to compile openh323 and I get an error...

# make opt
make -C src opt
make[1]: Entering directory `/home/slarsen/openh323_v1_19_0_1/src'
g++  -D_REENTRANT -Wall  -fPIC -DPIC -DPTRACING
-I/home/slarsen/openh323_v1_19_0_1/include
-I/usr/local/share/pwlib//include -Os   -felide-constructors -c
h323ep.cxx -o
/home/slarsen/openh323_v1_19_0_1/lib/obj_linux_x86_r/h323ep.o
/home/slarsen/openh323_v1_19_0_1/include/h4601.h: In member function
\u2018H460_FeatureContent::operator H460_FeatureTable*()\u2019:
/home/slarsen/openh323_v1_19_0_1/include/h4601.h:292: warning:
type-punning to incomplete type might break strict-aliasing rules
h323ep.cxx: In member function \u2018PNatMethod*
H323EndPoint::GetPreferedNatMethod(const PIPSocket::Address&)\u2019:
h323ep.cxx:3211: error: \u2018class PNatStrategy\u2019 has no member
named \u2018GetNATList\u2019
h323ep.cxx:3215: error: \u2018class PNatMethod\u2019 has no member named
\u2018GetNatMethodName\u2019
make[1]: ***
[/home/slarsen/openh323_v1_19_0_1/lib/obj_linux_x86_r/h323ep.o] Error 1
make[1]: Leaving directory `/home/slarsen/openh323_v1_19_0_1/src'
make: *** [opt] Error 2

Any thoughts?


--
Stewart Larsen

-------------------------------------------------------------------------
This SF.net email is sponsored by DB2 Express
Download DB2 Express C - the FREE version of DB2 express and take
control of your XML. No limits. Just data. Click to get it now.
http://sourceforge.net/powerbar/db2/
_______________________________________________
Openh323-devel mailing list
Openh323-devel@xxxxxxxxxxxxxxxxxxxxx
https://lists.sourceforge.net/lists/listinfo/openh323-devel

[Open H.323]     [IETF SIP]     [Gnu Gatekeeper]     [Asterisk PBX]     [Fedora Linux]     [Gimp]     [Yosemite News]     [Yosemite Photos]     [Yosemite Campsites]     [ISDN Cause Codes]

Add to Google Powered by Linux