Google
  Web www.spinics.net

build failure for 2.6.24-rc1

[Date Prev][Date Next][Thread Prev][Thread Next][Date Index][Thread Index]


hi,

build failure for 2.6.24-rc1

gcc -v
Reading specs from /usr/lib/gcc/i486-slackware-linux/4.1.2/specs
Target: i486-slackware-linux
Configured with: ../gcc-4.1.2/configure --prefix=/usr --enable-shared
--enable-languages=ada,c,c++,fortran,java,objc --enable-threads=posix
--enable-__cxa_atexit --disable-checking --with-gnu-ld --verbose
--with-arch=i486 --target=i486-slackware-linux
--host=i486-slackware-linux
Thread model: posix
gcc version 4.1.2


make[1]: Entering directory `/tmp/linux-2.6.24-rc1'
  CC [M]  /root/src/loop-AES-v3.2a/tmp-d-kbuild/patched-loop.o
/root/src/loop-AES-v3.2a/tmp-d-kbuild/patched-loop.c: In function
'loop_end_io_transfer':
/root/src/loop-AES-v3.2a/tmp-d-kbuild/patched-loop.c:471: error: too
many arguments to function 'bio_endio'
/root/src/loop-AES-v3.2a/tmp-d-kbuild/patched-loop.c: In function
'loop_get_buffer':
/root/src/loop-AES-v3.2a/tmp-d-kbuild/patched-loop.c:593: warning:
assignment from incompatible pointer type
/root/src/loop-AES-v3.2a/tmp-d-kbuild/patched-loop.c: At top level:
/root/src/loop-AES-v3.2a/tmp-d-kbuild/patched-loop.c:763: warning:
/'request_queue_t' is deprecated
/root/src/loop-AES-v3.2a/tmp-d-kbuild/patched-loop.c: In function
/'loop_issue_flush':
/root/src/loop-AES-v3.2a/tmp-d-kbuild/patched-loop.c:767: warning:
/'request_queue_t' is deprecated
/root/src/loop-AES-v3.2a/tmp-d-kbuild/patched-loop.c:781: error:
/'request_queue_t' has no member named 'issue_flush_fn'
/root/src/loop-AES-v3.2a/tmp-d-kbuild/patched-loop.c:786: error:
/'request_queue_t' has no member named 'issue_flush_fn'
/root/src/loop-AES-v3.2a/tmp-d-kbuild/patched-loop.c: At top level:
/root/src/loop-AES-v3.2a/tmp-d-kbuild/patched-loop.c:810: warning:
/'request_queue_t' is deprecated
/root/src/loop-AES-v3.2a/tmp-d-kbuild/patched-loop.c:813:40: error:
/macro "bio_io_error" passed 2 arguments, but takes just 1
/root/src/loop-AES-v3.2a/tmp-d-kbuild/patched-loop.c: In function
/'loop_make_request_err':
/root/src/loop-AES-v3.2a/tmp-d-kbuild/patched-loop.c:813: error:
/'bio_io_error' undeclared (first use in this function)
/root/src/loop-AES-v3.2a/tmp-d-kbuild/patched-loop.c:813: error:
/(Each undeclared identifier is reported only once
/root/src/loop-AES-v3.2a/tmp-d-kbuild/patched-loop.c:813: error: for
/each function it appears in.)
/root/src/loop-AES-v3.2a/tmp-d-kbuild/patched-loop.c: At top level:
/root/src/loop-AES-v3.2a/tmp-d-kbuild/patched-loop.c:817: warning:
/'request_queue_t' is deprecated
/root/src/loop-AES-v3.2a/tmp-d-kbuild/patched-loop.c:900:40: error:
/macro "bio_io_error" passed 2 arguments, but takes just 1
/root/src/loop-AES-v3.2a/tmp-d-kbuild/patched-loop.c: In function
/'loop_make_request_real':
/root/src/loop-AES-v3.2a/tmp-d-kbuild/patched-loop.c:900: error:
/'bio_io_error' undeclared (first use in this function)
/root/src/loop-AES-v3.2a/tmp-d-kbuild/patched-loop.c: At top level:
/root/src/loop-AES-v3.2a/tmp-d-kbuild/patched-loop.c:904: warning:
/'request_queue_t' is deprecated
/root/src/loop-AES-v3.2a/tmp-d-kbuild/patched-loop.c:918: warning:
/'request_queue_t' is deprecated
/root/src/loop-AES-v3.2a/tmp-d-kbuild/patched-loop.c: In function
/'loop_thread':
/root/src/loop-AES-v3.2a/tmp-d-kbuild/patched-loop.c:969: warning:
/'request_queue_t' is deprecated
/root/src/loop-AES-v3.2a/tmp-d-kbuild/patched-loop.c:1143: error: too
/many arguments to function 'bio_endio'
/root/src/loop-AES-v3.2a/tmp-d-kbuild/patched-loop.c:1161: error: too
/many arguments to function 'bio_endio'
/root/src/loop-AES-v3.2a/tmp-d-kbuild/patched-loop.c: In function
/'loop_set_fd':
/root/src/loop-AES-v3.2a/tmp-d-kbuild/patched-loop.c:1392: error:
/implicit declaration of function 'blk_queue_issue_flush_fn'
/root/src/loop-AES-v3.2a/tmp-d-kbuild/patched-loop.c:1399: warning:
/'request_queue_t' is deprecated
/root/src/loop-AES-v3.2a/tmp-d-kbuild/patched-loop.c:1405: error:
/'request_queue_t' has no member named 'issue_flush_fn'
make[2]: *** [/root/src/loop-AES-v3.2a/tmp-d-kbuild/patched-loop.o]
Error 1
make[1]: *** [_module_/root/src/loop-AES-v3.2a/tmp-d-kbuild] Error 2
make[1]: Leaving directory `/tmp/linux-2.6.24-rc1'
make: *** [all] Error 2

-- 
left blank, right bald

Attachment: pgpltcFHQf4xu.pgp
Description: PGP signature


[Home]     [Kernel]     [Linux Crypto]     [Gnu Crypto]     [Gnu Classpath]     [Netfilter]     [Bugtraq]     [Network Security Reading]

Add to Google