Re: [PATCH] ARM: S3C2440: Fixed build error for s3c244x

[Date Prev][Date Next][Thread Prev][Thread Next][Date Index][Thread Index]

On Thu, Mar 8, 2012 at 1:48 AM, Kukjin Kim <kgene.kim@xxxxxxxxxxx> wrote:
> Fixed following:
> arch/arm/mach-s3c2440/s3c244x.c: In function 's3c244x_restart':
> arch/arm/mach-s3c2440/s3c244x.c:209: error: expected declaration or statement at end of input
> make[1]: *** [arch/arm/mach-s3c24xx/s3c244x.o] Error 1
> make: *** [arch/arm/mach-s3c24xx] Error 2
>
> Signed-off-by: Kukjin Kim <kgene.kim@xxxxxxxxxxx>

Thanks, applied to fixes and I'll send out a pull request for the branch today.


-Olof

_______________________________________________
linux-arm-kernel mailing list
linux-arm-kernel@xxxxxxxxxxxxxxxxxxx
http://lists.infradead.org/mailman/listinfo/linux-arm-kernel


[Linux ARM (vger)]     [Linux ARM MSM]     [Linux Omap]     [Linux Arm]     [Linux Tegra]     [Fedora ARM]     [eCos]     [Linux Fastboot]     [Gcc Help]     [Git]     [DCCP]     [IETF Announce]     [Security]     [PDAs]     [Linux]     [Linux MIPS]     [Yosemite Campsites]     [Photos]

Add to Google Follow linuxarm on Twitter